Target
Epidermal growth factor receptor
Ligand
BDBM195886
Substrate
Meas. Tech.
EGFR kinase assay
Temperature
298.15±n/a K
IC50
429±n/a nM
Comments
extracted
Citation
 Li, HXu, YZhao, ZLiu, XZhou, WBai, FXue, MZhang, LZhang, Y Pteridine ketone derivative and applications thereof as EGFR, BLK, and FLT3 inhibitor US Patent  US9670213 Publication Date 6/6/2017 
Target
Name:
Epidermal growth factor receptor
Synonyms:
EGF Receptor Substrate EGFR_HUMAN ERBB1 Epidermal Growth Factor Receptor erbB-1 Epidermal growth factor receptor (EGFR) HER1 Proto-oncogene c-ErbB-1 Tyrosine-Protein Kinase ErbB-1
Type:
Receptor Kinase Domain
Mol. Mass.:
134279.59
Organism:
Homo sapiens (Human)
Description:
P00533
Residue:
1210
  
Inhibitor
Name:
BDBM195886
Synonyms:
US9670213, Compound 031 N-(4-(2-(2-methoxy)-4-(4-methoxy-1-piperazinyl)-phenylamino)-7-oxo-8(7H)-pteridinyl)phenyl)acrylamide
Type:
Small organic molecule
Emp. Form.:
C27H28N8O3
Mol. Mass.:
512.563
SMILES:
COc1cc(ccc1Nc1ncc2ncc(=O)n(-c3ccc(NC(=O)C=C)cc3)c2n1)N1CCN(C)CC1
: