Target
Rho-associated protein kinase 2
Ligand
BDBM263022
Substrate
Meas. Tech.
In Vitro Assay
IC50
21.8±n/a nM
Citation
 Quan, MLHu, ZWang, C Tricyclic pyrido-carboxamide derivatives as rock inhibitors US Patent  US9663529 Publication Date 5/30/2017 
Target
Name:
Rho-associated protein kinase 2
Synonyms:
KIAA0619 ROCK2 Rho kinase 2 (ROCKII) Rho-associated protein kinase 2 (ROCK2) Rho-associated protein kinase 2/Transforming protein RhoA Rho-associated, coiled-coil-containing protein kinase II p164 ROCK-2
Type:
Protein
Mol. Mass.:
160885.43
Organism:
Homo sapiens (Human)
Description:
O75116
Residue:
1388
  
Inhibitor
Name:
BDBM263022
Synonyms:
(S)-2-amino-N-(5H-chromeno[3,4-c]pyridin-8-yl)-2-phenylacetamide US9708337, 36
Type:
Small organic molecule
Emp. Form.:
C20H17N3O2
Mol. Mass.:
331.3679
SMILES:
N[C@H](C(=O)Nc1ccc-2c(OCc3cnccc-23)c1)c1ccccc1
: