Target
Rho-associated protein kinase 2
Ligand
BDBM330095
Substrate
Meas. Tech.
In Vitro Assay
IC50
207±n/a nM
Citation
 Quan, MLHu, ZWang, C Tricyclic pyrido-carboxamide derivatives as rock inhibitors US Patent  US9663529 Publication Date 5/30/2017 
Target
Name:
Rho-associated protein kinase 2
Synonyms:
KIAA0619 ROCK2 Rho kinase 2 (ROCKII) Rho-associated protein kinase 2 (ROCK2) Rho-associated protein kinase 2/Transforming protein RhoA Rho-associated, coiled-coil-containing protein kinase II p164 ROCK-2
Type:
Protein
Mol. Mass.:
160885.43
Organism:
Homo sapiens (Human)
Description:
O75116
Residue:
1388
  
Inhibitor
Name:
BDBM330095
Synonyms:
N-(5H-chromeno[3,4- c]pyridin-8-yl)-2- (pyridin-4-yl) acetamide | US9663529, Example I-34
Type:
Small organic molecule
Emp. Form.:
C19H15N3O2
Mol. Mass.:
317.3413
SMILES:
O=C(Cc1ccncc1)Nc1ccc-2c(OCc3cnccc-23)c1
: