Target
Rho-associated protein kinase 2
Ligand
BDBM330138
Substrate
Meas. Tech.
In Vitro Assay
IC50
2370±n/a nM
Citation
 Quan, MLHu, ZWang, C Tricyclic pyrido-carboxamide derivatives as rock inhibitors US Patent  US9663529 Publication Date 5/30/2017 
Target
Name:
Rho-associated protein kinase 2
Synonyms:
KIAA0619 ROCK2 Rho kinase 2 (ROCKII) Rho-associated protein kinase 2 (ROCK2) Rho-associated protein kinase 2/Transforming protein RhoA Rho-associated, coiled-coil-containing protein kinase II p164 ROCK-2
Type:
Protein
Mol. Mass.:
160885.43
Organism:
Homo sapiens (Human)
Description:
O75116
Residue:
1388
  
Inhibitor
Name:
BDBM330138
Synonyms:
1-(3-chlorophenyl)-3- (5H- chromeno[3,4- c]pyridin-8-yl) urea | US9663529, Example II-4
Type:
Small organic molecule
Emp. Form.:
C19H14ClN3O2
Mol. Mass.:
351.786
SMILES:
Clc1cccc(NC(=O)Nc2ccc-3c(OCc4cnccc-34)c2)c1
: