Target
Rho-associated protein kinase 2
Ligand
BDBM330157
Substrate
Meas. Tech.
In Vitro Assay
IC50
383±n/a nM
Citation
 Quan, MLHu, ZWang, C Tricyclic pyrido-carboxamide derivatives as rock inhibitors US Patent  US9663529 Publication Date 5/30/2017 
Target
Name:
Rho-associated protein kinase 2
Synonyms:
KIAA0619 ROCK2 Rho kinase 2 (ROCKII) Rho-associated protein kinase 2 (ROCK2) Rho-associated protein kinase 2/Transforming protein RhoA Rho-associated, coiled-coil-containing protein kinase II p164 ROCK-2
Type:
Protein
Mol. Mass.:
160885.43
Organism:
Homo sapiens (Human)
Description:
O75116
Residue:
1388
  
Inhibitor
Name:
BDBM330157
Synonyms:
2-(3-Cyanophenyl)-N-(9H-pyrido[3,4-b]indol-7-yl)acetamide | US9663529, Example IV-5
Type:
Small organic molecule
Emp. Form.:
C20H14N4O
Mol. Mass.:
326.3514
SMILES:
O=C(Cc1cccc(c1)C#N)Nc1ccc2c(c1)[nH]c1cnccc21
: