Target
Trace amine-associated receptor 1
Ligand
BDBM330179
Substrate
Meas. Tech.
Radioligand Binding Assay on Rat
IC50
13.7±n/a nM
Citation
 Cecere, GGalley, GHu, YNorcross, RPflieger, PShen, H 5-oxa-2-azabicyclo[2.2.2]OCTAN-4-yl and 5-oxa-2-azabicyclo[2.2.1]heptan-4-yl derivatives US Patent  US9663530 Publication Date 5/30/2017 
Target
Name:
Trace amine-associated receptor 1
Synonyms:
TAAR1_MOUSE Taar1 Trace amine receptor 1 (TARR1) Trace amine-associated receptor1 | Trar1
Type:
Protein
Mol. Mass.:
37635.41
Organism:
Mus musculus (Mouse)
Description:
Q923Y8
Residue:
332
  
Inhibitor
Name:
BDBM330179
Synonyms:
1-(4-Chlorophenyl)-3-[4-[[(1R,4R)-5-oxa-2-azabicyclo[2.2.1]heptan-4-yl]methyl]phenyl]urea | US9663530, Example 23
Type:
Small organic molecule
Emp. Form.:
C19H20ClN3O2
Mol. Mass.:
357.834
SMILES:
Clc1ccc(NC(=O)Nc2ccc(C[C@@]34CN[C@@H](CO3)C4)cc2)cc1
: