Target
Trace amine-associated receptor 1
Ligand
BDBM330187
Substrate
Meas. Tech.
Radioligand Binding Assay on Rat
IC50
946±n/a nM
Citation
 Cecere, GGalley, GHu, YNorcross, RPflieger, PShen, H 5-oxa-2-azabicyclo[2.2.2]OCTAN-4-yl and 5-oxa-2-azabicyclo[2.2.1]heptan-4-yl derivatives US Patent  US9663530 Publication Date 5/30/2017 
Target
Name:
Trace amine-associated receptor 1
Synonyms:
TAAR1_MOUSE Taar1 Trace amine receptor 1 (TARR1) Trace amine-associated receptor1 | Trar1
Type:
Protein
Mol. Mass.:
37635.41
Organism:
Mus musculus (Mouse)
Description:
Q923Y8
Residue:
332
  
Inhibitor
Name:
BDBM330187
Synonyms:
N-[4-[[(1S,4S)-5-Oxa-2-azabicyclo[2.2.1]heptan-4-yl]methyl]phenyl]-5-(trifluoromethyl)pyridin-2-amine | US9663530, Example 31
Type:
Small organic molecule
Emp. Form.:
C18H18F3N3O
Mol. Mass.:
349.3502
SMILES:
FC(F)(F)c1ccc(Nc2ccc(C[C@]34CN[C@H](CO3)C4)cc2)nc1
: