Target
Trace amine-associated receptor 1
Ligand
BDBM330189
Substrate
Meas. Tech.
Radioligand Binding Assay on Mouse
IC50
881±n/a nM
Citation
 Cecere, GGalley, GHu, YNorcross, RPflieger, PShen, H 5-oxa-2-azabicyclo[2.2.2]OCTAN-4-yl and 5-oxa-2-azabicyclo[2.2.1]heptan-4-yl derivatives US Patent  US9663530 Publication Date 5/30/2017 
Target
Name:
Trace amine-associated receptor 1
Synonyms:
TAAR1_RAT Taar1 Trace amine receptor 1 (TARR1) Trace amine-associated receptor 1 (TAAR1) Trar1
Type:
Enzyme
Mol. Mass.:
38034.73
Organism:
Rattus norvegicus (Rat)
Description:
Q923Y9
Residue:
332
  
Inhibitor
Name:
BDBM330189
Synonyms:
N-[4-[[(1S,4S)-5-Oxa-2-azabicyclo[2.2.1]heptan-4-yl]methyl]phenyl]-5-(trifluoromethyl)pyrimidin-2-amine | US9663530, Example 33
Type:
Small organic molecule
Emp. Form.:
C17H17F3N4O
Mol. Mass.:
350.3383
SMILES:
FC(F)(F)c1cnc(Nc2ccc(C[C@]34CN[C@H](CO3)C4)cc2)nc1
: