Target
Trace amine-associated receptor 1
Ligand
BDBM330203
Substrate
Meas. Tech.
Radioligand Binding Assay on Mouse
IC50
10.4±n/a nM
Citation
 Cecere, GGalley, GHu, YNorcross, RPflieger, PShen, H 5-oxa-2-azabicyclo[2.2.2]OCTAN-4-yl and 5-oxa-2-azabicyclo[2.2.1]heptan-4-yl derivatives US Patent  US9663530 Publication Date 5/30/2017 
Target
Name:
Trace amine-associated receptor 1
Synonyms:
TAAR1_RAT Taar1 Trace amine receptor 1 (TARR1) Trace amine-associated receptor 1 (TAAR1) Trar1
Type:
Enzyme
Mol. Mass.:
38034.73
Organism:
Rattus norvegicus (Rat)
Description:
Q923Y9
Residue:
332
  
Inhibitor
Name:
BDBM330203
Synonyms:
N-[4-[[(1R,4R)-5-Oxa-2-azabicyclo[2.2.1]heptan-4-yl]methyl]phenyl]-6-(2,2,2-trifluoroethoxy)pyridine-3-carboxamide | US9663530, Example 47
Type:
Small organic molecule
Emp. Form.:
C20H20F3N3O3
Mol. Mass.:
407.3863
SMILES:
FC(F)(F)COc1ccc(cn1)C(=O)Nc1ccc(C[C@@]23CN[C@@H](CO2)C3)cc1
: