Target
Trace amine-associated receptor 1
Ligand
BDBM330206
Substrate
Meas. Tech.
Radioligand Binding Assay on Rat
IC50
226±n/a nM
Citation
 Cecere, GGalley, GHu, YNorcross, RPflieger, PShen, H 5-oxa-2-azabicyclo[2.2.2]OCTAN-4-yl and 5-oxa-2-azabicyclo[2.2.1]heptan-4-yl derivatives US Patent  US9663530 Publication Date 5/30/2017 
Target
Name:
Trace amine-associated receptor 1
Synonyms:
TAAR1_MOUSE Taar1 Trace amine receptor 1 (TARR1) Trace amine-associated receptor1 | Trar1
Type:
Protein
Mol. Mass.:
37635.41
Organism:
Mus musculus (Mouse)
Description:
Q923Y8
Residue:
332
  
Inhibitor
Name:
BDBM330206
Synonyms:
2-Ethyl-N-[4-[[(1R,4R)-5-oxa-2-azabicyclo[2.2.1]heptan-4-yl]methyl]phenyl]pyrimidine-5-carboxamide | US9663530, Example 50
Type:
Small organic molecule
Emp. Form.:
C19H22N4O2
Mol. Mass.:
338.4036
SMILES:
CCc1ncc(cn1)C(=O)Nc1ccc(C[C@@]23CN[C@@H](CO2)C3)cc1
: