Target
Trace amine-associated receptor 1
Ligand
BDBM330211
Substrate
Meas. Tech.
Radioligand Binding Assay on Mouse
IC50
964±n/a nM
Citation
 Cecere, GGalley, GHu, YNorcross, RPflieger, PShen, H 5-oxa-2-azabicyclo[2.2.2]OCTAN-4-yl and 5-oxa-2-azabicyclo[2.2.1]heptan-4-yl derivatives US Patent  US9663530 Publication Date 5/30/2017 
Target
Name:
Trace amine-associated receptor 1
Synonyms:
TAAR1_RAT Taar1 Trace amine receptor 1 (TARR1) Trace amine-associated receptor 1 (TAAR1) Trar1
Type:
Enzyme
Mol. Mass.:
38034.73
Organism:
Rattus norvegicus (Rat)
Description:
Q923Y9
Residue:
332
  
Inhibitor
Name:
BDBM330211
Synonyms:
3-Chloro-N-[4-[(1R,4S)-5-oxa-2-azabicyclo[2.2.1]heptan-4-yl]phenyl]benzamide | US9663530, Example 55
Type:
Small organic molecule
Emp. Form.:
C18H17ClN2O2
Mol. Mass.:
328.793
SMILES:
Clc1cccc(c1)C(=O)Nc1ccc(cc1)[C@@]12CN[C@@H](CO1)C2
: