Target
5-hydroxytryptamine receptor 2A
Ligand
BDBM330283
Substrate
Meas. Tech.
p38 MAPKα Enzyme Inhibition
IC50
77.0±n/a nM
Citation
 Ito, KCharron, CEKing-Underwood, JOnions, STLongshaw, AI 1-pyrazolyl-3-(4-((2-anilinopyrimidin-4-yl)oxy)napththalen-1-yl) ureas as P38 MAP knase inhibitors US Patent  US9724347 Publication Date 8/8/2017 
Target
Name:
5-hydroxytryptamine receptor 2A
Synonyms:
5-HT-2 5-HT2A 5-hydroxytryptamine receptor 2A (5HT-2A) 5HT2A_HUMAN HTR2A | Serotonin receptor 2A
Type:
undefined
Mol. Mass.:
52607.65
Organism:
Homo sapiens (Human)
Description:
P28223
Residue:
471
  
Inhibitor
Name:
BDBM330283
Synonyms:
1-(3-(tert-butyl)-1-(p-tolyl)-1H-pyrazol-5-yl)- 3-(4-((2-((4-hydroxy-3-methoxyphenyl) amino)pyrimidin-4-yl)oxy)naphthalen-1- yl)urea US10813932, Example 25 US9993478, Example 25
Type:
Small organic molecule
Emp. Form.:
C36H35N7O4
Mol. Mass.:
629.7076
SMILES:
COc1cc(Nc2nccc(Oc3ccc(NC(=O)Nc4cc(nn4-c4ccc(C)cc4)C(C)(C)C)c4ccccc34)n2)ccc1O
: