Target
Proto-oncogene tyrosine-protein kinase Src
Ligand
BDBM142598
Substrate
Meas. Tech.
c-Src and Syk Enzyme Inhibition
IC50
5.00±n/a nM
Citation
 Ito, KCharron, CEKing-Underwood, JOnions, STLongshaw, AI 1-pyrazolyl-3-(4-((2-anilinopyrimidin-4-yl)oxy)napththalen-1-yl) ureas as P38 MAP knase inhibitors US Patent  US9724347 Publication Date 8/8/2017 
Target
Name:
Proto-oncogene tyrosine-protein kinase Src
Synonyms:
Calmodulin/Proto-oncogene tyrosine-protein kinase Src Proto-oncogene c-Src SRC SRC_HUMAN V-src sarcoma (Schmidt-Ruppin A-2) viral oncogene homolog (avian) p60-Src | pp60c-src
Type:
Protein
Mol. Mass.:
59838.60
Organism:
Homo sapiens (Human)
Description:
P12931
Residue:
536
  
Inhibitor
Name:
BDBM142598
Synonyms:
US10238658, Example Reference US8933228, Ref 2 US9249125, Reference Compound US9724347, Example Reference | US9993478, Example Reference
Type:
Small organic molecule
Emp. Form.:
C33H34N6O4
Mol. Mass.:
578.6609
SMILES:
COCC(=O)Nc1cc(Oc2ccc(NC(=O)Nc3cc(nn3-c3ccc(C)cc3)C(C)(C)C)c3ccccc23)ccn1
: