Target
Lethal factor
Ligand
BDBM11989
Substrate
fluorogenic LF protease substrate III
Meas. Tech.
HPLC Assay
pH
7.2±n/a
Temperature
300.15±n/a K
Ki
900±n/a nM
IC50
8200±n/a nM
Citation
 Schepetkin, IAKhlebnikov, AIKirpotina, LNQuinn, MT Novel small-molecule inhibitors of anthrax lethal factor identified by high-throughput screening. J Med Chem 49:5232-44 (2006)  
Target
Name:
Lethal factor
Synonyms:
Anthrax Lethal Factor (LF) Antrax lethal toxin lef | lethal factor
Type:
PROTEIN
Mol. Mass.:
93758.56
Organism:
Bacillus anthracis
Description:
ChEMBL_1460338
Residue:
809
  
Inhibitor
Name:
BDBM11989
Synonyms:
2-chloro-5-[(4Z)-3-methyl-5-oxo-4-{[4-(propan-2-yl)phenyl]methylidene}-4,5-dihydro-1H-pyrazol-1-yl]benzoic acid | chemical diversity library compound 14
Type:
Small organic molecule
Emp. Form.:
C21H19ClN2O3
Mol. Mass.:
382.84
SMILES:
CC(C)c1ccc(C=c2c(=C)[nH]n(-c3ccc(Cl)c(c3)C(O)=O)c2=O)cc1
:
Substrate
Name:
fluorogenic LF protease substrate III
Synonyms:
Type:
Peptide
Mol. Mass.:
358.43
Organism:
Description:
Residue:
3
NA