Target
Non-specific protein-tyrosine kinase
Ligand
BDBM50328199
Substrate
Meas. Tech.
Kinase Assay
pH
7.5±n/a
IC50
300±n/a nM
Comments
extracted
Citation
 Gray, NSZhang, JOkram, BDeng, X Small molecule myristate inhibitors of Bcr-abl and methods of use US Patent  US9670214 Publication Date 6/6/2017 
Target
Name:
Non-specific protein-tyrosine kinase
Synonyms:
BCR/ABL fusion protein isoform X3
Type:
Protein
Mol. Mass.:
178596.49
Organism:
Homo sapiens (Human)
Description:
A9UEZ6
Residue:
1633
  
Inhibitor
Name:
BDBM50328199
Synonyms:
1-ethyl-N-(4-(trifluoromethoxy)phenyl)-1H-pyrazolo[3,4-d]pyrimidin-4-amine US9670214, TABLE 10.2
Type:
Small organic molecule
Emp. Form.:
C14H12F3N5O
Mol. Mass.:
323.2732
SMILES:
CCn1ncc2c(Nc3ccc(OC(F)(F)F)cc3)ncnc12
: