Target
Non-specific protein-tyrosine kinase [T818I]
Ligand
BDBM50328202
Substrate
Meas. Tech.
Kinase Assay
pH
7.5±n/a
IC50
>10000±n/a nM
Comments
extracted
Citation
 Gray, NSZhang, JOkram, BDeng, X Small molecule myristate inhibitors of Bcr-abl and methods of use US Patent  US9670214 Publication Date 6/6/2017 
Target
Name:
Non-specific protein-tyrosine kinase [T818I]
Synonyms:
A9UEZ6_HUMAN BCR/ABL fusion protein (T351I)
Type:
Protein
Mol. Mass.:
178608.54
Organism:
Homo sapiens (Human)
Description:
A9UEZ6[T818I]
Residue:
1633
  
Inhibitor
Name:
BDBM50328202
Synonyms:
2-(4-(4-(trifluoromethoxy)phenylamino)-1H-pyrazolo[3,4-d]pyrimidin-1-yl)acetamide US9670214, TABLE 10.9
Type:
Small organic molecule
Emp. Form.:
C14H11F3N6O2
Mol. Mass.:
352.2713
SMILES:
NC(=O)Cn1ncc2c(Nc3ccc(OC(F)(F)F)cc3)ncnc12
: