Target
Non-specific protein-tyrosine kinase [T818I]
Ligand
BDBM196100
Substrate
Meas. Tech.
Kinase Assay
pH
7.5±n/a
IC50
>10000±n/a nM
Comments
extracted
Citation
 Gray, NSZhang, JOkram, BDeng, X Small molecule myristate inhibitors of Bcr-abl and methods of use US Patent  US9670214 Publication Date 6/6/2017 
Target
Name:
Non-specific protein-tyrosine kinase [T818I]
Synonyms:
A9UEZ6_HUMAN BCR/ABL fusion protein (T351I)
Type:
Protein
Mol. Mass.:
178608.54
Organism:
Homo sapiens (Human)
Description:
A9UEZ6[T818I]
Residue:
1633
  
Inhibitor
Name:
BDBM196100
Synonyms:
US9670214, TABLE 10.14
Type:
Small organic molecule
Emp. Form.:
C17H16F3N7O
Mol. Mass.:
391.3504
SMILES:
CN(C)CC(C#N)n1ncc2c(Nc3ccc(OC(F)(F)F)cc3)ncnc12
: