Target
Non-specific protein-tyrosine kinase [T818I]
Ligand
BDBM196196
Substrate
Meas. Tech.
Kinase Assay
pH
7.5±n/a
IC50
2030±n/a nM
Comments
extracted
Citation
 Gray, NSZhang, JOkram, BDeng, X Small molecule myristate inhibitors of Bcr-abl and methods of use US Patent  US9670214 Publication Date 6/6/2017 
Target
Name:
Non-specific protein-tyrosine kinase [T818I]
Synonyms:
A9UEZ6_HUMAN BCR/ABL fusion protein (T351I)
Type:
Protein
Mol. Mass.:
178608.54
Organism:
Homo sapiens (Human)
Description:
A9UEZ6[T818I]
Residue:
1633
  
Inhibitor
Name:
BDBM196196
Synonyms:
US9670214, TABLE 10.28
Type:
Small organic molecule
Emp. Form.:
C19H14F3N5O2
Mol. Mass.:
401.342
SMILES:
Oc1cccc(Cn2ncc3c(Nc4ccc(OC(F)(F)F)cc4)ncnc23)c1
: