Target
Non-specific protein-tyrosine kinase
Ligand
BDBM196238
Substrate
Meas. Tech.
Kinase Assay
pH
7.5±n/a
IC50
194±n/a nM
Comments
extracted
Citation
 Gray, NSZhang, JOkram, BDeng, X Small molecule myristate inhibitors of Bcr-abl and methods of use US Patent  US9670214 Publication Date 6/6/2017 
Target
Name:
Non-specific protein-tyrosine kinase
Synonyms:
BCR/ABL fusion protein isoform X3
Type:
Protein
Mol. Mass.:
178596.49
Organism:
Homo sapiens (Human)
Description:
A9UEZ6
Residue:
1633
  
Inhibitor
Name:
BDBM196238
Synonyms:
US9670214, TABLE 10.41
Type:
Small organic molecule
Emp. Form.:
C18H11F4N5O
Mol. Mass.:
389.3065
SMILES:
Fc1ccccc1-n1cc2c(Nc3ccc(OC(F)(F)F)cc3)ncnc2n1
: