Target
Non-specific protein-tyrosine kinase [T818I]
Ligand
BDBM196341
Substrate
Meas. Tech.
Kinase Assay
pH
7.5±n/a
IC50
1920±n/a nM
Comments
extracted
Citation
 Gray, NSZhang, JOkram, BDeng, X Small molecule myristate inhibitors of Bcr-abl and methods of use US Patent  US9670214 Publication Date 6/6/2017 
Target
Name:
Non-specific protein-tyrosine kinase [T818I]
Synonyms:
A9UEZ6_HUMAN BCR/ABL fusion protein (T351I)
Type:
Protein
Mol. Mass.:
178608.54
Organism:
Homo sapiens (Human)
Description:
A9UEZ6[T818I]
Residue:
1633
  
Inhibitor
Name:
BDBM196341
Synonyms:
US9670214, TABLE 13.13
Type:
Small organic molecule
Emp. Form.:
C25H19F6N5O2S
Mol. Mass.:
567.506
SMILES:
FC(F)(F)Oc1ccc(Nc2ncnc3sc(cc23)C(=O)N2CCN(CC2)c2cccc(c2)C(F)(F)F)cc1
: