Target
Non-specific protein-tyrosine kinase
Ligand
BDBM196609
Substrate
Meas. Tech.
Kinase Assay
pH
7.5±n/a
IC50
940±n/a nM
Comments
extracted
Citation
 Gray, NSZhang, JOkram, BDeng, X Small molecule myristate inhibitors of Bcr-abl and methods of use US Patent  US9670214 Publication Date 6/6/2017 
Target
Name:
Non-specific protein-tyrosine kinase
Synonyms:
BCR/ABL fusion protein isoform X3
Type:
Protein
Mol. Mass.:
178596.49
Organism:
Homo sapiens (Human)
Description:
A9UEZ6
Residue:
1633
  
Inhibitor
Name:
BDBM196609
Synonyms:
US9670214, TABLE 16.58
Type:
Small organic molecule
Emp. Form.:
C16H12F3N3O3
Mol. Mass.:
351.28
SMILES:
COc1cc(co1)-c1cc(Nc2ccc(OC(F)(F)F)cc2)ncn1
: