Target
Non-specific protein-tyrosine kinase
Ligand
BDBM196618
Substrate
Meas. Tech.
Kinase Assay
pH
7.5±n/a
IC50
6250±n/a nM
Comments
extracted
Citation
 Gray, NSZhang, JOkram, BDeng, X Small molecule myristate inhibitors of Bcr-abl and methods of use US Patent  US9670214 Publication Date 6/6/2017 
Target
Name:
Non-specific protein-tyrosine kinase
Synonyms:
BCR/ABL fusion protein isoform X3
Type:
Protein
Mol. Mass.:
178596.49
Organism:
Homo sapiens (Human)
Description:
A9UEZ6
Residue:
1633
  
Inhibitor
Name:
BDBM196618
Synonyms:
US9670214, TABLE 16.67
Type:
Small organic molecule
Emp. Form.:
C34H30F6N8O3
Mol. Mass.:
712.6442
SMILES:
Cc1ccc(NC(=O)c2ccc(CN3CCOCC3)c(c2)C(F)(F)F)cc1Nc1nccn1-c1cc(Nc2ccc(OC(F)(F)F)cc2)ncn1
: