Target
Cyclin-T1/Cyclin-dependent kinase 9
Ligand
BDBM12026
Substrate
Biotinylated Peptide Substrate
Meas. Tech.
CDK Inhibition Assay
Temperature
303.15±n/a K
IC50
12400±n/a nM
Comments
extracted
Citation
 Krystof, VCankar, PFrysova, ISlouka, JKontopidis, GDzubak, PHajduch, MSrovnal, Jde Azevedo, WFOrsag, MPaprskarova, MRolcik, JLatr, AFischer, PMStrnad, M 4-arylazo-3,5-diamino-1H-pyrazole CDK inhibitors: SAR study, crystal structure in complex with CDK2, selectivity, and cellular effects. J Med Chem 49:6500-9 (2006)  
Target
Name:
Cyclin-T1/Cyclin-dependent kinase 9
Synonyms:
CDK9/ Cyclin-T1 CDK9/Cyclin T Cyclin T1/dependent kinase 9 | Cyclin-Dependent Kinase 9 (CDK9)
Type:
Protein Complex
Mol. Mass.:
Description:
Components:
This complex has 2 components.
Component 1
Name:
Cyclin-T1
Synonyms:
CCNT1 CycT Cyclin T Cyclin-T
Type:
Enzyme Subunit
Mol. Mass.:
80712.40
Organism:
Homo sapiens (Human)
Description:
Residue:
726
  
Component 2
Name:
Cyclin-dependent kinase 9
Synonyms:
C-2K CDK9 Cell division cycle 2-like protein kinase 4 Cyclin-Dependent Kinase 9 (CDK9) Serine/threonine-protein kinase PITALRE Tat-associated kinase complex catalytic subunit
Type:
Enzyme Subunit
Mol. Mass.:
42789.13
Organism:
Homo sapiens (Human)
Description:
Residue:
372
  
Inhibitor
Name:
BDBM12026
Synonyms:
4-Arylazo-3,5-diamino-1H-pyrazole 27b | 4-[(E)-2-(3-nitrophenyl)diazen-1-yl]-1H-pyrazole-3,5-diamine
Type:
Small organic molecule
Emp. Form.:
C9H9N7O2
Mol. Mass.:
247.2135
SMILES:
Nc1n[nH]c(N)c1\N=N\c1cccc(c1)[N+]([O-])=O
:
Substrate
Name:
Biotinylated Peptide Substrate
Synonyms:
Type:
Peptide
Mol. Mass.:
10968.97
Organism:
Description:
Residue:
86