Target
Sigma intracellular receptor 2
Ligand
BDBM312187
Substrate
Meas. Tech.
Receptor Assay
Ki
2.12±0.75 nM
Citation
 McCurdy, CRMesangeau, CChin, FTJames, MLShen, BGambhir, SBiswal, SBehera, D Highly selective sigma receptor ligands and radioligands as probes in nociceptive processing and the pathphysiological study of memory deficits and cognitive disorders US Patent  US9724435 Publication Date 8/8/2017 
Target
Name:
Sigma intracellular receptor 2
Synonyms:
S2r Sigma intracellular receptor 2 Sigma2 receptor Transmembrane protein 97
Type:
Protein
Mol. Mass.:
20953.88
Organism:
Rattus norvegicus (Rat)
Description:
Q5U3Y7
Residue:
176
  
Inhibitor
Name:
BDBM312187
Synonyms:
US9604926, Compound CM-325 | US9724435, Compound CM-325
Type:
Small organic molecule
Emp. Form.:
C27H35FN4O
Mol. Mass.:
450.5914
SMILES:
Fc1ccc(cc1)-n1c2ccccc2n(CCCCN2CCN(CC2)C2CCCCC2)c1=O
: