Target
Caspase-1
Ligand
BDBM12059
Substrate
Caspase-1 Fluorogenic Substrate
Meas. Tech.
Caspase Inhibition Assay
pH
7±n/a
Temperature
310.15±n/a K
Ki
1100±n/a nM
Citation
 Shahripour, ABPlummer, MSLunney, EASawyer, TKStankovic, CJConnolly, MKRubin, JRWalker, NPBrady, KDAllen, HJTalanian, RVWong, WWHumblet, C Structure-based design of caspase-1 inhibitor containing a diphenyl ether sulfonamide. Bioorg Med Chem Lett 11:2779-82 (2001)  
Target
Name:
Caspase-1
Synonyms:
CASP1 Caspase ICE IL1BCE Interleukin-1 beta-converting enzyme
Type:
Enzyme
Mol. Mass.:
45154.13
Organism:
Homo sapiens (Human)
Description:
P29466
Residue:
404
  
Inhibitor
Name:
BDBM12059
Synonyms:
(3S)-3-{[2-(4-methylphenoxy)benzene]sulfonamido}-4-oxobutanoic acid | Diphenyl Ether Sulfonamide 5
Type:
Small organic molecule
Emp. Form.:
C17H17NO6S
Mol. Mass.:
363.385
SMILES:
Cc1ccc(Oc2ccccc2S(=O)(=O)N[C@@H](CC(O)=O)C=O)cc1
:
Substrate
Name:
Caspase-1 Fluorogenic Substrate
Synonyms:
Ac-YVAD-AMC
Type:
Mol. Mass.:
1713.07
Organism:
Description:
AMC=7-Amino-4-methylcoumarin
Residue:
17
ACTYRVALALAASPAMC