Target
Caspase-1
Ligand
BDBM12063
Substrate
Caspase-1 Fluorogenic Substrate
Meas. Tech.
Caspase Inhibition Assay
pH
7±n/a
Temperature
310.15±n/a K
Ki
620±n/a nM
Citation
 Shahripour, ABPlummer, MSLunney, EASawyer, TKStankovic, CJConnolly, MKRubin, JRWalker, NPBrady, KDAllen, HJTalanian, RVWong, WWHumblet, C Structure-based design of caspase-1 inhibitor containing a diphenyl ether sulfonamide. Bioorg Med Chem Lett 11:2779-82 (2001)  
Target
Name:
Caspase-1
Synonyms:
CASP1 Caspase ICE IL1BCE Interleukin-1 beta-converting enzyme
Type:
Enzyme
Mol. Mass.:
45154.13
Organism:
Homo sapiens (Human)
Description:
P29466
Residue:
404
  
Inhibitor
Name:
BDBM12063
Synonyms:
(3S)-4-oxo-3-({2-[4-(propan-2-yl)phenoxy]benzene}sulfonamido)butanoic acid | Diphenyl Ether Sulfonamide 9
Type:
Small organic molecule
Emp. Form.:
C19H21NO6S
Mol. Mass.:
391.438
SMILES:
CC(C)c1ccc(Oc2ccccc2S(=O)(=O)N[C@@H](CC(O)=O)C=O)cc1
:
Substrate
Name:
Caspase-1 Fluorogenic Substrate
Synonyms:
Ac-YVAD-AMC
Type:
Mol. Mass.:
1713.07
Organism:
Description:
AMC=7-Amino-4-methylcoumarin
Residue:
17
ACTYRVALALAASPAMC