Target
Cannabinoid receptor 1
Ligand
BDBM163042
Substrate
Meas. Tech.
Radioligand Binding Assay
Temperature
298.15±n/a K
IC50
1023±n/a nM
Comments
extracted
Citation
 Chen, JPettit, SFliri, H Cannabinoid-2 agonists US Patent  US9670216 Publication Date 6/6/2017 
Target
Name:
Cannabinoid receptor 1
Synonyms:
CANN6 CB-R CNR CNR1_HUMAN Cannabinoid receptor Cannabinoid receptor 1 (brain)
Type:
G Protein-Coupled Receptor (GPCR)
Mol. Mass.:
52868.96
Organism:
Homo sapiens (Human)
Description:
P21554
Residue:
472
  
Inhibitor
Name:
BDBM163042
Synonyms:
US9062004, 5 | US9670216, 13 4-Bromo-5-propylamino-2-(3,3,5,5-tetramethylcyclohexyl)pyridazin-3-one
Type:
Small organic molecule
Emp. Form.:
C17H28ClN3O
Mol. Mass.:
325.877
SMILES:
CCCNc1cnn(C2CC(C)(C)CC(C)(C)C2)c(=O)c1Cl
: