Target
Cannabinoid receptor 2
Ligand
BDBM163044
Substrate
Meas. Tech.
Radioligand Binding Assay
Temperature
298.15±n/a K
IC50
380±n/a nM
Comments
extracted
Citation
 Chen, JPettit, SFliri, H Cannabinoid-2 agonists US Patent  US9670216 Publication Date 6/6/2017 
Target
Name:
Cannabinoid receptor 2
Synonyms:
CANNABINOID CB2 CB2 CB2B CNR2_HUMAN Cannabinoid CB2 receptor Cannabinoid receptor 2 (CB2R) | hCB2
Type:
G Protein-Coupled Receptor (GPCR)
Mol. Mass.:
39690.94
Organism:
Homo sapiens (Human)
Description:
P34972
Residue:
360
  
Inhibitor
Name:
BDBM163044
Synonyms:
US9062004, 7 | US9670216, 7 5-Dimethylamino-2-(3,3,5,5-tetramethylcyclohexyl)pyridazin-3-one
Type:
Small organic molecule
Emp. Form.:
C16H27N3O
Mol. Mass.:
277.4051
SMILES:
CN(C)c1cnn(C2CC(C)(C)CC(C)(C)C2)c(=O)c1
: