Target
Cannabinoid receptor 2
Ligand
BDBM163060
Substrate
Meas. Tech.
Radioligand Binding Assay
Temperature
298.15±n/a K
IC50
10000±n/a nM
Comments
extracted
Citation
 Chen, JPettit, SFliri, H Cannabinoid-2 agonists US Patent  US9670216 Publication Date 6/6/2017 
Target
Name:
Cannabinoid receptor 2
Synonyms:
CANNABINOID CB2 CB2 CB2B CNR2_HUMAN Cannabinoid CB2 receptor Cannabinoid receptor 2 (CB2R) | hCB2
Type:
G Protein-Coupled Receptor (GPCR)
Mol. Mass.:
39690.94
Organism:
Homo sapiens (Human)
Description:
P34972
Residue:
360
  
Inhibitor
Name:
BDBM163060
Synonyms:
US9062004, 26 | US9670216, 26 4-Chloro-2-(2,5-dimethylphenyl)-5-propylaminopyridazin-3-one
Type:
Small organic molecule
Emp. Form.:
C15H18ClN3O
Mol. Mass.:
291.776
SMILES:
CCCNc1cnn(-c2cc(C)ccc2C)c(=O)c1Cl
: