Target
Cyclin-A2 [171-432]/Cyclin-dependent kinase 2 [K89T]
Ligand
BDBM5544
Substrate
Histone H1
Meas. Tech.
CDK Inhibition Assay
pH
7.5±n/a
Temperature
303.15±n/a K
IC50
8.9±n/a nM
Citation
 Pratt, DJBentley, JJewsbury, PBoyle, FTEndicott, JANoble, ME Dissecting the determinants of cyclin-dependent kinase 2 and cyclin-dependent kinase 4 inhibitor selectivity. J Med Chem 49:5470-7 (2006)  
Target
Name:
Cyclin-A2 [171-432]/Cyclin-dependent kinase 2 [K89T]
Synonyms:
Cyclin-Dependent Kinase 2 (CDK2) Mutant (K89T)
Type:
Protein Complex
Mol. Mass.:
Description:
Components:
This complex has 2 components.
Component 1
Name:
Cyclin-dependent kinase 2 [K89T]
Synonyms:
CDK2 CDKN2 | Cyclin-Dependent Kinase 2 (CDK2) Mutant (K89T)
Type:
Enzyme Subunit
Mol. Mass.:
33910.10
Organism:
Homo sapiens (Human)
Description:
P24941[K89T]
Residue:
298
  
Component 2
Name:
Cyclin-A2 [171-432]
Synonyms:
CCN1 CCNA2 cyclin A2
Type:
Enzyme Subunit
Mol. Mass.:
30018.91
Organism:
Homo sapiens (Human)
Description:
cyclin A2 is a c-terminal cyclin A fragment encoding residues 171-432.
Residue:
262
  
Inhibitor
Name:
BDBM5544
Synonyms:
4-{[6-(cyclohexylmethoxy)-9H-purin-2-yl]amino}benzene-1-sulfonamide NU6102
Type:
Small organic molecule
Emp. Form.:
C18H22N6O3S
Mol. Mass.:
402.471
SMILES:
NS(=O)(=O)c1ccc(Nc2nc(OCC3CCCCC3)c3[nH]cnc3n2)cc1
:
Substrate
Name:
Histone H1
Synonyms:
Type:
Other Protein Type
Mol. Mass.:
358.43
Organism:
Bos taurus (bovine)
Description:
Residue:
3
NA