Target
Cyclin-dependent kinase 4/G1/S-specific cyclin-D1
Ligand
BDBM12100
Substrate
Histone H1
Meas. Tech.
Kinase Multiscreen Assay
pH
7.4±n/a
Temperature
295.15±n/a K
IC50
>10000±n/a nM
Citation
 Pevarello, PFancelli, DVulpetti, AAmici, RVilla, MPittala, VVianello, PCameron, ACiomei, MMercurio, CBischoff, JRRoletto, FVarasi, MBrasca, MG 3-Amino-1,4,5,6-tetrahydropyrrolo[3,4-c]pyrazoles: a new class of CDK2 inhibitors. Bioorg Med Chem Lett 16:1084-90 (2006)  
Target
Name:
Cyclin-dependent kinase 4/G1/S-specific cyclin-D1
Synonyms:
CDK4/CycD CDK4/Cyclin D1 Cyclin-Dependent Kinase 4 (CDK4) Cyclin-dependent kinase 4/G1/S-specific cyclin D1 | Cyclin-dependent kinase 4/cyclin D1
Type:
Protein Complex
Mol. Mass.:
Description:
CDK4/D1 complexes were purified from insect cells co-infected with baculovirus vectors containing each of the components.
Components:
This complex has 2 components.
Component 1
Name:
Cyclin-dependent kinase 4
Synonyms:
CDK4 Cell division protein kinase 4 PSK-J3
Type:
Enzyme Subunit
Mol. Mass.:
33731.96
Organism:
Homo sapiens (Human)
Description:
P11802
Residue:
303
  
Component 2
Name:
G1/S-specific cyclin-D1
Synonyms:
B-cell lymphoma 1 protein BCL-1 oncogene CCND1 PRAD1 | PRAD1 oncogene
Type:
Enzyme Subunit
Mol. Mass.:
33717.70
Organism:
Homo sapiens (Human)
Description:
Residue:
295
  
Inhibitor
Name:
BDBM12100
Synonyms:
3-Amino-1,4,5,6-tetrahydropyrrolo[3,4-c]pyrazole 18 | N-butyl-3-[(2S)-2-(naphthalen-2-yl)propanamido]-1H,4H,5H,6H-pyrrolo[3,4-c]pyrazole-5-carboxamide
Type:
Small organic molecule
Emp. Form.:
C23H27N5O2
Mol. Mass.:
405.4928
SMILES:
CCCCNC(=O)N1Cc2n[nH]c(NC(=O)[C@@H](C)c3ccc4ccccc4c3)c2C1
:
Substrate
Name:
Histone H1
Synonyms:
Type:
Other Protein Type
Mol. Mass.:
358.43
Organism:
Bos taurus (bovine)
Description:
Residue:
3
NA