Target
Cystathionine gamma-lyase
Ligand
BDBM330324
Substrate
Meas. Tech.
In Vitro Assay
IC50
<10000±n/a nM
Citation
 Durón, SGChapman, JSydserff, SGRao, SGStein, GWade, W Cystathionine-γ-lyase (CSE) inhibitors US Patent  US9725426 Publication Date 8/8/2017 
Target
Name:
Cystathionine gamma-lyase
Synonyms:
CGL_HUMAN Cystathionine gamma-lyase (CSE) Gamma-cystathionase
Type:
Protein
Mol. Mass.:
44509.52
Organism:
Homo sapiens (Human)
Description:
P32929
Residue:
405
  
Inhibitor
Name:
BDBM330324
Synonyms:
US9725426, 28
Type:
Small organic molecule
Emp. Form.:
C5H10N6
Mol. Mass.:
154.1731
SMILES:
CN(N=C(C)C)c1nnn[nH]1
: