Target
Cystathionine gamma-lyase
Ligand
BDBM330328
Substrate
Meas. Tech.
In Vitro Assay
IC50
>100000±n/a nM
Citation
 Durón, SGChapman, JSydserff, SGRao, SGStein, GWade, W Cystathionine-γ-lyase (CSE) inhibitors US Patent  US9725426 Publication Date 8/8/2017 
Target
Name:
Cystathionine gamma-lyase
Synonyms:
CGL_HUMAN Cystathionine gamma-lyase (CSE) Gamma-cystathionase
Type:
Protein
Mol. Mass.:
44509.52
Organism:
Homo sapiens (Human)
Description:
P32929
Residue:
405
  
Inhibitor
Name:
BDBM330328
Synonyms:
US9725426, 33
Type:
Small organic molecule
Emp. Form.:
C4H8N6O
Mol. Mass.:
156.1459
SMILES:
CCN(N)C(=O)c1nnn[nH]1
: