Target
Vascular endothelial growth factor receptor 2
Ligand
BDBM110543
Substrate
Meas. Tech.
FLIPR Assay
IC50
23.0±n/a nM
Citation
 Guo, XZhu, Z Compounds as tyrosine kinase modulators US Patent  US9725433 Publication Date 8/8/2017 
Target
Name:
Vascular endothelial growth factor receptor 2
Synonyms:
CD_antigen=CD309 Fetal liver kinase 1 (FLK-1) KDR Protein-tyrosine kinase receptor Flk-1 VEGFR-2 VEGFR2 Vascular Endothelial Growth Factor Receptor Kinase 2 Vascular endothelial growth factor receptor 2 (KDR) Vascular endothelial growth factor receptor 2 (VEGFR2) Vascular endothelial growth factor receptor-2 (VEGFR-2)
Type:
Receptor Tyrosine Kinase
Mol. Mass.:
151510.97
Organism:
Homo sapiens (Human)
Description:
P35968
Residue:
1356
  
Inhibitor
Name:
BDBM110543
Synonyms:
US8614234, 11 | US9725433, 11
Type:
Small organic molecule
Emp. Form.:
C24H19FN4O4
Mol. Mass.:
446.4305
SMILES:
Cc1ccc(F)c(NC(=O)c2cccc(Oc3ccnc(c3)-c3cc(c[nH]3)C(=O)NO)c2)c1
: