Target
Vascular endothelial growth factor receptor 1
Ligand
BDBM110543
Substrate
Meas. Tech.
Kinase Assay
IC50
34.0±n/a nM
Citation
 Guo, XZhu, Z Compounds as tyrosine kinase modulators US Patent  US9725433 Publication Date 8/8/2017 
Target
Name:
Vascular endothelial growth factor receptor 1
Synonyms:
FLT FRT Fms-like tyrosine kinase 1 Tyrosine-protein kinase FRT VEGFR-1 VGFR1_HUMAN Vascular endothelial growth factor receptor 1 (FLT1) Vascular endothelial growth factor receptor 1 and 2 (Flt-1 and KDR) Vascular permeability factor receptor vascular endothelial growth factor/vascular permeability factor receptor
Type:
Receptor Tyrosine Kinase
Mol. Mass.:
150800.23
Organism:
Homo sapiens (Human)
Description:
P17948
Residue:
1338
  
Inhibitor
Name:
BDBM110543
Synonyms:
US8614234, 11 | US9725433, 11
Type:
Small organic molecule
Emp. Form.:
C24H19FN4O4
Mol. Mass.:
446.4305
SMILES:
Cc1ccc(F)c(NC(=O)c2cccc(Oc3ccnc(c3)-c3cc(c[nH]3)C(=O)NO)c2)c1
: