Target
Vascular endothelial growth factor receptor 2
Ligand
BDBM110556
Substrate
Meas. Tech.
FLIPR Assay
IC50
24.0±n/a nM
Citation
 Guo, XZhu, Z Compounds as tyrosine kinase modulators US Patent  US9725433 Publication Date 8/8/2017 
Target
Name:
Vascular endothelial growth factor receptor 2
Synonyms:
CD_antigen=CD309 Fetal liver kinase 1 (FLK-1) KDR Protein-tyrosine kinase receptor Flk-1 VEGFR-2 VEGFR2 Vascular Endothelial Growth Factor Receptor Kinase 2 Vascular endothelial growth factor receptor 2 (KDR) Vascular endothelial growth factor receptor 2 (VEGFR2) Vascular endothelial growth factor receptor-2 (VEGFR-2)
Type:
Receptor Tyrosine Kinase
Mol. Mass.:
151510.97
Organism:
Homo sapiens (Human)
Description:
P35968
Residue:
1356
  
Inhibitor
Name:
BDBM110556
Synonyms:
US8614234, 24 | US9725433, 24
Type:
Small organic molecule
Emp. Form.:
C24H21N3O5S
Mol. Mass.:
463.506
SMILES:
Cc1ccsc1C(=O)Nc1cccc(Oc2ccnc(c2)-c2cc(c[nH]2)C(=O)OCCO)c1
: