Target
Vascular endothelial growth factor receptor 2
Ligand
BDBM110560
Substrate
Meas. Tech.
FLIPR Assay
IC50
52.0±n/a nM
Citation
 Guo, XZhu, Z Compounds as tyrosine kinase modulators US Patent  US9725433 Publication Date 8/8/2017 
Target
Name:
Vascular endothelial growth factor receptor 2
Synonyms:
CD_antigen=CD309 Fetal liver kinase 1 (FLK-1) KDR Protein-tyrosine kinase receptor Flk-1 VEGFR-2 VEGFR2 Vascular Endothelial Growth Factor Receptor Kinase 2 Vascular endothelial growth factor receptor 2 (KDR) Vascular endothelial growth factor receptor 2 (VEGFR2) Vascular endothelial growth factor receptor-2 (VEGFR-2)
Type:
Receptor Tyrosine Kinase
Mol. Mass.:
151510.97
Organism:
Homo sapiens (Human)
Description:
P35968
Residue:
1356
  
Inhibitor
Name:
BDBM110560
Synonyms:
US8614234, 28 | US9725433, 28
Type:
Small organic molecule
Emp. Form.:
C22H16FN3O5
Mol. Mass.:
421.3779
SMILES:
Cc1ccoc1C(=O)Nc1cc(Oc2ccnc(c2)-c2cc(c[nH]2)C(O)=O)ccc1F
: