Target
Vascular endothelial growth factor receptor 2
Ligand
BDBM110569
Substrate
Meas. Tech.
FLIPR Assay
IC50
2610±n/a nM
Citation
 Guo, XZhu, Z Compounds as tyrosine kinase modulators US Patent  US9725433 Publication Date 8/8/2017 
Target
Name:
Vascular endothelial growth factor receptor 2
Synonyms:
CD_antigen=CD309 Fetal liver kinase 1 (FLK-1) KDR Protein-tyrosine kinase receptor Flk-1 VEGFR-2 VEGFR2 Vascular Endothelial Growth Factor Receptor Kinase 2 Vascular endothelial growth factor receptor 2 (KDR) Vascular endothelial growth factor receptor 2 (VEGFR2) Vascular endothelial growth factor receptor-2 (VEGFR-2)
Type:
Receptor Tyrosine Kinase
Mol. Mass.:
151510.97
Organism:
Homo sapiens (Human)
Description:
P35968
Residue:
1356
  
Inhibitor
Name:
BDBM110569
Synonyms:
US8614234, 37 | US9725433, 37
Type:
Small organic molecule
Emp. Form.:
C21H17N3O3
Mol. Mass.:
359.378
SMILES:
Cc1ccoc1C(=O)Nc1ccc(Oc2ccnc(c2)-c2ccc[nH]2)cc1
: