Target
Vascular endothelial growth factor receptor 2
Ligand
BDBM110578
Substrate
Meas. Tech.
FLIPR Assay
IC50
28.0±n/a nM
Citation
 Guo, XZhu, Z Compounds as tyrosine kinase modulators US Patent  US9725433 Publication Date 8/8/2017 
Target
Name:
Vascular endothelial growth factor receptor 2
Synonyms:
CD_antigen=CD309 Fetal liver kinase 1 (FLK-1) KDR Protein-tyrosine kinase receptor Flk-1 VEGFR-2 VEGFR2 Vascular Endothelial Growth Factor Receptor Kinase 2 Vascular endothelial growth factor receptor 2 (KDR) Vascular endothelial growth factor receptor 2 (VEGFR2) Vascular endothelial growth factor receptor-2 (VEGFR-2)
Type:
Receptor Tyrosine Kinase
Mol. Mass.:
151510.97
Organism:
Homo sapiens (Human)
Description:
P35968
Residue:
1356
  
Inhibitor
Name:
BDBM110578
Synonyms:
US8614234, 46 | US9725433, 46
Type:
Small organic molecule
Emp. Form.:
C34H36FN5O7
Mol. Mass.:
645.6773
SMILES:
COC(=O)[C@H](CCC(=O)OC(C)(C)C)NC(=O)c1c[nH]c(c1)-c1cc(Oc2ccc(NC(=O)Nc3cccc(C)c3)c(F)c2)ccn1
: