Target
Vascular endothelial growth factor receptor 1
Ligand
BDBM110642
Substrate
Meas. Tech.
Kinase Assay
IC50
10.00±n/a nM
Citation
 Guo, XZhu, Z Compounds as tyrosine kinase modulators US Patent  US9725433 Publication Date 8/8/2017 
Target
Name:
Vascular endothelial growth factor receptor 1
Synonyms:
FLT FRT Fms-like tyrosine kinase 1 Tyrosine-protein kinase FRT VEGFR-1 VGFR1_HUMAN Vascular endothelial growth factor receptor 1 (FLT1) Vascular endothelial growth factor receptor 1 and 2 (Flt-1 and KDR) Vascular permeability factor receptor vascular endothelial growth factor/vascular permeability factor receptor
Type:
Receptor Tyrosine Kinase
Mol. Mass.:
150800.23
Organism:
Homo sapiens (Human)
Description:
P17948
Residue:
1338
  
Inhibitor
Name:
BDBM110642
Synonyms:
US8614234, 110 | US9725433, 110
Type:
Small organic molecule
Emp. Form.:
C27H26FN5O4
Mol. Mass.:
503.5248
SMILES:
Cc1ccc(F)c(NC(=O)Nc2ccc(Oc3ccnc(c3)-c3cc(c[nH]3)C(=O)NCCCO)cc2)c1
: