Target
Orexin receptor type 2
Ligand
BDBM330345
Substrate
Meas. Tech.
FLIPR Ca2+ Flux Assay
IC50
119±n/a nM
Citation
 Kuduk, SDLiverton, NLSkudlarek, JW Hydroxy-substituted orexin receptor antagonists US Patent  US9725434 Publication Date 8/8/2017 
Target
Name:
Orexin receptor type 2
Synonyms:
HCRTR2 OX2R_HUMAN Orexin receptor type 2 (OR-2) Orexin receptor type 2 (OX2R) Ox-2-R | Ox2-R
Type:
Protein
Mol. Mass.:
50710.53
Organism:
Homo sapiens (Human)
Description:
O43614
Residue:
444
  
Inhibitor
Name:
BDBM330345
Synonyms:
1-[3-({(3R,6R)-6-Methyl-1-[(2-pyrimidin-2-ylphenyl)carbonyl]piperidin-3-yl}oxy)phenyl]ethanol | US9725434, 3
Type:
Small organic molecule
Emp. Form.:
C25H27N3O3
Mol. Mass.:
417.5002
SMILES:
CC(O)c1cccc(O[C@@H]2CC[C@@H](C)N(C2)C(=O)c2ccccc2-c2ncccn2)c1
: