Target
Orexin receptor type 2
Ligand
BDBM330368
Substrate
Meas. Tech.
FLIPR Ca2+ Flux Assay
IC50
19.0±n/a nM
Citation
 Kuduk, SDLiverton, NLSkudlarek, JW Hydroxy-substituted orexin receptor antagonists US Patent  US9725434 Publication Date 8/8/2017 
Target
Name:
Orexin receptor type 2
Synonyms:
HCRTR2 OX2R_HUMAN Orexin receptor type 2 (OR-2) Orexin receptor type 2 (OX2R) Ox-2-R | Ox2-R
Type:
Protein
Mol. Mass.:
50710.53
Organism:
Homo sapiens (Human)
Description:
O43614
Residue:
444
  
Inhibitor
Name:
BDBM330368
Synonyms:
(1R)-6-{[(3R,6R)- 6-Methyl-1-{[2- (2H-1,2,3-triazol- 2-yl)phenyl] carbonyl} piperidin-3-yl]oxy}-2,3-dihydro-1H-inden-1-ol | US9725434, 27
Type:
Small organic molecule
Emp. Form.:
C24H26N4O3
Mol. Mass.:
418.4882
SMILES:
C[C@@H]1CC[C@H](CN1C(=O)c1ccccc1-n1nccn1)Oc1ccc2CC[C@@H](O)c2c1
: