Target
Orexin/Hypocretin receptor type 1
Ligand
BDBM330378
Substrate
Meas. Tech.
FLIPR Ca2+ Flux Assay
IC50
7279±n/a nM
Citation
 Kuduk, SDLiverton, NLSkudlarek, JW Hydroxy-substituted orexin receptor antagonists US Patent  US9725434 Publication Date 8/8/2017 
Target
Name:
Orexin/Hypocretin receptor type 1
Synonyms:
HCRTR1 OX1R_HUMAN Orexin receptor type 1 (OR 1) Orexin receptor type 1 (OX1) Orexin receptor type 1 (OxR1) | Ox1r
Type:
Protein
Mol. Mass.:
47554.50
Organism:
Homo sapiens (Human)
Description:
O43613
Residue:
425
  
Inhibitor
Name:
BDBM330378
Synonyms:
2-(3-{[(3R,6R)-6-Methyl-1-{[2-(2H-1,2,3-triazol-2-yl)phenyl]carbonyl}piperidin-3-yl]oxy}phenyl)butan-2-ol | US9725434, 36
Type:
Small organic molecule
Emp. Form.:
C24H26F2N4O3
Mol. Mass.:
456.485
SMILES:
C[C@@H]1CC[C@H](CN1C(=O)c1ccccc1-n1nccn1)Oc1cccc(c1)C(C)(O)C(F)F
: