Target
Orexin receptor type 2
Ligand
BDBM330379
Substrate
Meas. Tech.
FLIPR Ca2+ Flux Assay
IC50
45.0±n/a nM
Citation
 Kuduk, SDLiverton, NLSkudlarek, JW Hydroxy-substituted orexin receptor antagonists US Patent  US9725434 Publication Date 8/8/2017 
Target
Name:
Orexin receptor type 2
Synonyms:
HCRTR2 OX2R_HUMAN Orexin receptor type 2 (OR-2) Orexin receptor type 2 (OX2R) Ox-2-R | Ox2-R
Type:
Protein
Mol. Mass.:
50710.53
Organism:
Homo sapiens (Human)
Description:
O43614
Residue:
444
  
Inhibitor
Name:
BDBM330379
Synonyms:
2-(3-{[(3R,6R)-6-Methyl-1-{[2-(2H-1,2,3-triazol-2-yl)thiophen-3-yl]carbonyl}piperidin-3-yl]oxy}phenyl)propan-2-ol | US9725434, 37
Type:
Small organic molecule
Emp. Form.:
C22H26N4O3S
Mol. Mass.:
426.532
SMILES:
C[C@@H]1CC[C@H](CN1C(=O)c1ccsc1-n1nccn1)Oc1cccc(c1)C(C)(C)O
: