Target
Sphingosine 1-phosphate receptor 1
Ligand
BDBM195895
Substrate
Meas. Tech.
In Vitro Functional Activity (Agonism) on Human S1P1 Receptors (Method B)
Temperature
298.15±n/a K
EC50
10.00±n/a nM
Comments
extracted
Citation
 Smid, PIwema Bakker, WICoolen, HKSliedregt, LAvan Dongen, MJden Hartog, JAHobson, A Fused heterocyclic derivatives as S1P modulators US Patent  US9670220 Publication Date 6/6/2017 
Target
Name:
Sphingosine 1-phosphate receptor 1
Synonyms:
CHEDG1 Endothelial differentiation G-protein coupled receptor 1 S1P1 S1PR1_HUMAN Sphingosine 1-phosphate receptor Edg-1
Type:
Enzyme
Mol. Mass.:
42836.02
Organism:
Homo sapiens (Human)
Description:
P21453
Residue:
382
  
Inhibitor
Name:
BDBM195895
Synonyms:
US9670220, 73
Type:
Small organic molecule
Emp. Form.:
C24H23F2NO4
Mol. Mass.:
427.4405
SMILES:
OC(=O)CCCN1CCc2oc(cc2C1)-c1ccc(OCc2ccccc2F)c(F)c1
: