Target
Sphingosine 1-phosphate receptor 5
Ligand
BDBM196174
Substrate
Meas. Tech.
In Vitro Functional Activity (Agonism) on Human 51P5 Receptors
EC50
6.30±n/a nM
Citation
 Smid, PIwema Bakker, WICoolen, HKSliedregt, LAvan Dongen, MJden Hartog, JAHobson, A Fused heterocyclic derivatives as S1P modulators US Patent  US9670220 Publication Date 6/6/2017 
Target
Name:
Sphingosine 1-phosphate receptor 5
Synonyms:
EDG8 S1P5 S1PR5_HUMAN Sphingosine 1-phosphate receptor Edg-8
Type:
G Protein-Coupled Receptor (GPCR)
Mol. Mass.:
41796.42
Organism:
Homo sapiens (Human)
Description:
Residue:
398
  
Inhibitor
Name:
BDBM196174
Synonyms:
US9670220, 89
Type:
Small organic molecule
Emp. Form.:
C24H25FN2O4
Mol. Mass.:
424.4647
SMILES:
Cc1cc(ccc1OCc1ccccc1F)-c1nc2CN(CCCC(O)=O)CCc2o1
: