Target
Sphingosine 1-phosphate receptor 3
Ligand
BDBM196286
Substrate
Meas. Tech.
In Vitro Functional Activity (Agonism) on Human S1P3 Receptors
EC50
>10000±n/a nM
Citation
 Smid, PIwema Bakker, WICoolen, HKSliedregt, LAvan Dongen, MJden Hartog, JAHobson, A Fused heterocyclic derivatives as S1P modulators US Patent  US9670220 Publication Date 6/6/2017 
Target
Name:
Sphingosine 1-phosphate receptor 3
Synonyms:
C9orf108 EDG3 S1P receptor 3 S1P3 S1PR3_HUMAN Sphingosine 1-phosphate receptor 3 (S1P3) | Sphingosine 1-phosphate receptor Edg-3
Type:
G Protein-Coupled Receptor (GPCR)
Mol. Mass.:
42278.13
Organism:
Homo sapiens (Human)
Description:
Q99500
Residue:
378
  
Inhibitor
Name:
BDBM196286
Synonyms:
US9670220, 306
Type:
Small organic molecule
Emp. Form.:
C25H23F3N2O5
Mol. Mass.:
488.4557
SMILES:
OC(=O)[C@H]1CC(C1)N1CCc2oc(nc2C1)-c1ccc(OCc2ccc(OC(F)(F)F)cc2)cc1
: