Target
Epidermal growth factor receptor [T790M,L858R]
Ligand
BDBM330419
Substrate
Meas. Tech.
Vitro Enzymology Assay
IC50
134±n/a nM
Citation
 Xiao, DZhu, YHu, YWang, HLi, JPeng, YZhang, HLuo, HKong, FHan, Y Quinazoline derivative and preparation method therefor US Patent  US9725439 Publication Date 8/8/2017 
Target
Name:
Epidermal growth factor receptor [T790M,L858R]
Synonyms:
EGFR EGFR_HUMAN ERBB1 Epidermal growth factor receptor (EGFR)(T790M/L858R) Epidermal growth factor receptor (T790M, L858R) Epidermal growth factor receptor(L858R, T790M) | HER1
Type:
Mol. Mass.:
134353.72
Organism:
Homo sapiens (Human)
Description:
P00533[T790M,L858R]
Residue:
1210
  
Inhibitor
Name:
BDBM330419
Synonyms:
6-(1-acryloylpiperidin-4-yl)thio-N-(3-chloro-4-fluorophenyl)-7-methoxyquinazoline-4-amine | US9725439, 21
Type:
Small organic molecule
Emp. Form.:
C23H22ClFN4O2S
Mol. Mass.:
472.963
SMILES:
COc1cc2ncnc(Nc3ccc(F)c(Cl)c3)c2cc1SC1CCN(CC1)C(=O)C=C
: