Target
Dipeptidyl peptidase 8
Ligand
BDBM11695
Substrate
BDBM11526
Meas. Tech.
Enzyme Inhibition Assay
IC50
14219±n/a nM
Citation
 Tsai, TYCoumar, MSHsu, THsieh, HPChien, CHChen, CTChang, CNLo, YKWu, SHHuang, CYHuang, YWWang, MHWu, HYLee, HJChen, XChao, YSJiaang, WT Substituted pyrrolidine-2,4-dicarboxylic acid amides as potent dipeptidyl peptidase IV inhibitors. Bioorg Med Chem Lett 16:3268-72 (2006)  
Target
Name:
Dipeptidyl peptidase 8
Synonyms:
DPP8 DPRP-1 Dipeptidyl peptidase 8 (DPP-8) Dipeptidyl peptidase 8/9 Dipeptidyl peptidase VIII Prolyl dipeptidase DPP8
Type:
Enzyme
Mol. Mass.:
103342.62
Organism:
Homo sapiens (Human)
Description:
Q6V1X1
Residue:
898
  
Inhibitor
Name:
BDBM11695
Synonyms:
(2S)-1-{2-[(3-hydroxyadamantan-1-yl)amino]acetyl}pyrrolidine-2-carbonitrile NVP-LAF237
Type:
Small organic molecule
Emp. Form.:
C17H25N3O2
Mol. Mass.:
303.3993
SMILES:
OC12CC3CC(C1)CC(C3)(C2)NCC(=O)N1CCC[C@H]1C#N
:
Substrate
Name:
BDBM11526
Synonyms:
1-(2-aminoacetyl)-N-(4-nitrophenyl)pyrrolidine-2-carboxamide Gly-Pro-pNA
Type:
Small organic molecule
Emp. Form.:
C13H16N4O4
Mol. Mass.:
292.2905
SMILES:
NCC(=O)N1CCCC1C(=O)Nc1ccc(cc1)[N+]([O-])=O
: