Target
Prostaglandin D2 receptor 2
Ligand
BDBM330473
Substrate
Meas. Tech.
Receptor Binding Inhibition Assay
Ki
10.00±n/a nM
Citation
 Hata, KMasuda, MNakai, HTaniyama, DTobinaga, HHato, YFujiu, M Heterocyclic derivative having PGD2 receptor antagonist activity US Patent  US9725442 Publication Date 8/8/2017 
Target
Name:
Prostaglandin D2 receptor 2
Synonyms:
CD_antigen=CD294 Chemoattractant Receptor-homologous molecule expressed on T-helper type 2 cells (CRTH2) Chemoattractant receptor-homologous molecule expressed on Th2 cells (CRTH2) G protein-coupled receptor 44 GPR44 PTGDR2 Prostaglandin D2 receptor 2 | Prostaglandin D2 receptor 2 (PGD2)
Type:
Enzyme
Mol. Mass.:
43295.45
Organism:
Homo sapiens (Human)
Description:
Q9Y5Y4
Residue:
395
  
Inhibitor
Name:
BDBM330473
Synonyms:
US9725442, Compound I-210
Type:
Small organic molecule
Emp. Form.:
C23H26FN3O5S
Mol. Mass.:
475.533
SMILES:
CC(C)Oc1ccc(cc1)S(=O)(=O)N1CC[C@H]([C@@H]1C)n1nc(CC(O)=O)c2ccc(F)cc12
: